is identified by Name
type: ObjectProperty
comment: Should have name attached via the appellation in UTF-8 and ASCII
sub property of: P87 is identified by
domain: Place

is identified by geoNamesID
type: ObjectProperty
comment: geoID from GeoNames.org
sub property of: P87 is identified by
domain: Place

NamedEntity
type: Class
subclass of: E77 Persistent Item
subclass of: Thing
subclass of: Restriction
  on property: has preferred namedEntityIdentifier
  cardinality: 1
comment: Named Entity beschreibt ein Referenz Objekt des Instituts, es ist mit einem Eindeutigen Identifier versehen. P48 ist verbunden mit einem MPIWG identifier.

NamedEntityIdentifier
type: Class
subclass of: E42 Identifier
subclass of: Thing
subclass of: Restriction
  on property: was createdBy by NamedEntityIdentifierCreation
  cardinality: 1
comment: Identifier eines Providers (z.B. VIAF, etc..) der Provider ist angebunden über