AnnotationContext
type: Class
comment: Sollte wenn möglich eine URI sein, a.l.a. xpointer

DocuviewerText
type: Class
subclass of: AnnotationResource
comment: XML Volltext der im Dokuviewer angezeigt wird

AnnotationRange
type: Class
comment: Bescchreibt eine geordnete Folge von Ressource, die annotiert werden soll. z.B. von Seite 3 Zeile 5 bis Seite 9 Zeil 8 eines Buches.

relatesTargets
type: ObjectProperty
range: Class
  union of: AnnotationResource
  union of: AnnotationContext
comment: Genaure Beschreibung der Beziehung von Targets untereinander, z.B. copy_of etc..
domain: Class
  union of: AnnotationResource
  union of: AnnotationContext

annotatesDocuviewerText
type: Property
sub property of: annotatesResource
comment: Annotiert einen Text mit einer URL im Docuviewer Format.

textSelection
type: Property
comment: Selection of a text on a web page described as an xpointer
sub property of: context

alternatePresentation
type: TransitiveProperty
type: SymmetricProperty
type: ObjectProperty
sub property of: relatesTargets
comment: Verweiset auf Ressourcen oder Contexte, die den gleichen Inhalt wiedergeben, z.B. eine Transcription und das dazugehörige Bild, bzw. jeweils Teile davon.

hasEnd
type: FunctionalProperty
domain: AnnotationRange
range: Class
  union of: AnnotationContext
  union of: AnnotationResource
comment: End des Ranges
type: ObjectProperty

hasOrderList
type: FunctionalProperty
comment: beschreibt die Ordnung der Ressourcen zwischen Anfangs- und Endressource, falls dies nicht gleich sind, bzw. nicht als hinterheinander folgend definiert werden.
domain: AnnotationRange
type: ObjectProperty

hasStart
type: FunctionalProperty
range: Class
  union of: AnnotationContext
  union of: AnnotationResource
type: ObjectProperty
domain: AnnotationRange
comment: Anfangspunkt des Ranges

annotatesContext
type: AnnotationProperty
domain: Annotation
comment: Genaurere Beschreibung der Contextes einer Annotation
type: ObjectProperty
range: AnnotationContext
sub property of: annotates

relates
comment: Genauere Beschrein

hasOrder
comment: Ordnung der Ressourcen zwischen Start und Anfang

isPartOf
type: AnnotationProperty
range: AnnotationResource
comment: Ressource von der dieser Context ein Teil ist, in der Regel sollte Context eine Ressource (URI) mit XPointer sein, die Ressource ist dann nur die URI
sub property of: isPartOf
domain: AnnotationContext
type: ObjectProperty
inverse of: hasPart

hasPart
type: AnnotationProperty
range: AnnotationContext
domain: AnnotationResource
type: ObjectProperty
comment: Genauere Beschreibung der Annotation
sub property of: hasPart
inverse of: isPartOf